BDBM50109342 1-Methyl-5-[(R)-5-(3,4,5-trimethoxy-phenyl)-4,5-dihydro-oxazol-2-yl]-1H-indole::CHEMBL143680
SMILES COc1cc(cc(OC)c1OC)[C@@H]1CN=C(O1)c1ccc2n(C)ccc2c1
InChI Key InChIKey=VVXYHELHUZGLHK-IBGZPJMESA-N
Data  1 KI
  Tab Delimited (TSV)   2D SDfile   Computed 3D by Vconf -m prep SDfile
Find this compound or compounds like it in BindingDB:
Activity Spreadsheet -- Enzyme Inhibition Constant Data from BindingDB
Found 1 hit for monomerid = 50109342
TargetTubulin beta-2B chain(Bos taurus)
Abbott Laboratories
Curated by ChEMBL
LigandPNGBDBM50109342(1-Methyl-5-[(R)-5-(3,4,5-trimethoxy-phenyl)-4,5-di...)
Affinity DataKi:  3.69E+3nM. Assay description: Binding constant at colchicine site of bovine brain tubulin
In DepthDetails ArticlePubMed