BDBM50109376 4-[4-(3,4-Dimethoxy-phenyl)-thiazol-2-yl]-5-methyl-thiophene-2-carboxamidine::CHEMBL343884
SMILES COc1ccc(cc1OC)-c1csc(n1)-c1cc(sc1C)C(N)=N
InChI Key InChIKey=LIWUUXYWSYYDIP-UHFFFAOYSA-N
Data  1 KI
  Tab Delimited (TSV)   2D SDfile   Computed 3D by Vconf -m prep SDfile
Find this compound or compounds like it in BindingDB:
Activity Spreadsheet -- Enzyme Inhibition Constant Data from BindingDB
Found 1 hit for monomerid = 50109376
TargetUrokinase-type plasminogen activator(Homo sapiens (Human))
3-Dimensional Pharmaceuticals
Curated by ChEMBL
LigandPNGBDBM50109376(4-[4-(3,4-Dimethoxy-phenyl)-thiazol-2-yl]-5-methyl...)
Affinity DataKi:  169nM. Assay description: Inhibition of Human kidney cell urokinase
In DepthDetails ArticlePubMed