BDBM50109395 CHEMBL3601220
SMILES OC(=O)CN(c1ccc(N(CC(O)=O)S(=O)(=O)c2ccc(cc2)C#N)c2ccccc12)S(=O)(=O)c1ccc(cc1)C#N
InChI Key InChIKey=ONBIYOXDYQDZBR-UHFFFAOYSA-N
Data  1 IC50
  Tab Delimited (TSV)   2D SDfile   Computed 3D by Vconf -m prep SDfile
Find this compound or compounds like it in BindingDB:
Activity Spreadsheet -- Enzyme Inhibition Constant Data from BindingDB
Found 1 hit for monomerid = 50109395
TargetNuclear factor erythroid 2-related factor 2(Homo sapiens (Human))
China Pharmaceutical University
Curated by ChEMBL
LigandPNGBDBM50109395(CHEMBL3601220)
Affinity DataIC50:  118nM. Assay description: Inhibition of Keap1 Kelch domain-Nrf2 ETGE (unknown origin) protein-protein interaction incubated for 30 mins by fluorescence polarization competitio...
In DepthDetails ArticlePubMed