BDBM50110538 4-Cyclohexyl-1-{1-[4-(4-methoxy-benzenesulfonyl)-phenyl]-ethyl}-2-methyl-piperazine::CHEMBL424530
SMILES COc1ccc(cc1)S(=O)(=O)c1ccc(cc1)[C@@H](C)N1CCN(C[C@H]1C)C1CCCCC1
InChI Key InChIKey=DZFNPOZRQHNAAX-NHCUHLMSSA-N
Data  1 KI
  Tab Delimited (TSV)   2D SDfile   Computed 3D by Vconf -m prep SDfile
Find this compound or compounds like it in BindingDB:
Activity Spreadsheet -- Enzyme Inhibition Constant Data from BindingDB
Found 1 hit for monomerid = 50110538
TargetMuscarinic acetylcholine receptor M2(Homo sapiens (Human))
Schering-Plough Research Institute
Curated by ChEMBL
LigandPNGBDBM50110538(4-Cyclohexyl-1-{1-[4-(4-methoxy-benzenesulfonyl)-p...)
Affinity DataKi:  0.150nM. Assay description: Binding affinity against human cloned Muscarinic acetylcholine receptor M2.
In DepthDetails ArticlePubMed