BDBM50110585 4-(4-Bromo-6-nitro-quinolin-2-yl)-piperazine-1-carbaldehyde::CHEMBL166461
SMILES [O-][N+](=O)c1ccc2nc(cc(Br)c2c1)N1CCN(CC1)C=O
InChI Key InChIKey=DJCGJQPACMISAR-UHFFFAOYSA-N
Data  1 KI
  Tab Delimited (TSV)   2D SDfile   Computed 3D by Vconf -m prep SDfile
Find this compound or compounds like it in BindingDB:
Activity Spreadsheet -- Enzyme Inhibition Constant Data from BindingDB
Found 1 hit for monomerid = 50110585
TargetSodium-dependent serotonin transporter(Rattus norvegicus (rat))
Inha University
Curated by ChEMBL
LigandPNGBDBM50110585(4-(4-Bromo-6-nitro-quinolin-2-yl)-piperazine-1-car...)
Affinity DataKi:  1.70nM. Assay description: Compound was evaluated for its ability to displace [3H]citalopram binding to the rat cortical Serotonin transporter
In DepthDetails ArticlePubMed