BDBM50110806 CHEMBL3605951
SMILES Clc1ccc(cc1)C(=O)C(=C)n1cnc2ccccc12
InChI Key InChIKey=IYKFIINNQOFITE-UHFFFAOYSA-N
Data  1 EC50
  Tab Delimited (TSV)   2D SDfile   Computed 3D by Vconf -m prep SDfile
Find this compound or compounds like it in BindingDB:
Activity Spreadsheet -- Enzyme Inhibition Constant Data from BindingDB
Found 1 hit for monomerid = 50110806
TargetDNA (cytosine-5)-methyltransferase 3A(Homo sapiens (Human))
Unit£
Curated by ChEMBL
LigandPNGBDBM50110806(CHEMBL3605951)
Affinity DataEC50:  4.00E+3nM. Assay description: Inhibition of human C-terminal DNMT3A after 1 hr by fluorescence assay
In DepthDetails ArticlePubMed