BDBM50110828 CHEMBL3605974
SMILES NC(=O)c1cccc2CN(CCc3ccccn3)C(=O)c12
InChI Key InChIKey=JDJQWPULECUFIA-UHFFFAOYSA-N
Data  2 Kd
  Tab Delimited (TSV)   2D SDfile   Computed 3D by Vconf -m prep SDfile
Find this compound or compounds like it in BindingDB:
Activity Spreadsheet -- Enzyme Inhibition Constant Data from BindingDB
Found 2 hits for monomerid = 50110828
TargetPoly [ADP-ribose] polymerase 1(Homo sapiens (Human))
Nerviano Medical Sciences
Curated by ChEMBL
LigandPNGBDBM50110828(CHEMBL3605974)
Affinity DataKd: <30nM. Assay description: Binding affinity to full length recombinant human PARP-1 by fluorescence polarization displacement assay
In DepthDetails ArticlePubMed
TargetPoly [ADP-ribose] polymerase 2(Homo sapiens (Human))
Nerviano Medical Sciences
Curated by ChEMBL
LigandPNGBDBM50110828(CHEMBL3605974)
Affinity DataKd: <30nM. Assay description: Binding affinity to full length recombinant human PARP-2 by fluorescence polarization displacement assay
In DepthDetails ArticlePubMed