BDBM50110839 CHEMBL3605993
SMILES CC(C)CN1CCC(CC1)N1Cc2cccc(C(N)=O)c2C1=O
InChI Key InChIKey=YEJCAPFHBURMPY-UHFFFAOYSA-N
Data  2 Kd
  Tab Delimited (TSV)   2D SDfile   Computed 3D by Vconf -m prep SDfile
Find this compound or compounds like it in BindingDB:
Activity Spreadsheet -- Enzyme Inhibition Constant Data from BindingDB
Found 2 hits for monomerid = 50110839
TargetPoly [ADP-ribose] polymerase 2(Homo sapiens (Human))
Nerviano Medical Sciences
Curated by ChEMBL
LigandPNGBDBM50110839(CHEMBL3605993)
Affinity DataKd:  264nM. Assay description: Binding affinity to full length recombinant human PARP-2 by fluorescence polarization displacement assay
In DepthDetails ArticlePubMed
TargetPoly [ADP-ribose] polymerase 1(Homo sapiens (Human))
Nerviano Medical Sciences
Curated by ChEMBL
LigandPNGBDBM50110839(CHEMBL3605993)
Affinity DataKd: <30nM. Assay description: Binding affinity to full length recombinant human PARP-1 by fluorescence polarization displacement assay
In DepthDetails ArticlePubMed