BDBM50111640 CHEMBL16607::N-[(S)-1-(10-Amino-decylcarbamoyl)-2-(4-hydroxy-phenyl)-ethyl]-butyramide
SMILES CCCC(=O)N[C@@H](Cc1ccc(O)cc1)C(=O)NCCCCCCCCCCN
InChI Key InChIKey=WIRJPXVURQFZIX-NRFANRHFSA-N
Data  1 IC50
  Tab Delimited (TSV)   2D SDfile   Computed 3D by Vconf -m prep SDfile
Find this compound or compounds like it in BindingDB:
Activity Spreadsheet -- Enzyme Inhibition Constant Data from BindingDB
Found 1 hit for monomerid = 50111640
TargetAcetylcholine receptor subunit delta(Homo sapiens (Human))
The Royal Danish School Of Pharmacy
Curated by ChEMBL
LigandPNGBDBM50111640(CHEMBL16607 | N-[(S)-1-(10-Amino-decylcarbamoyl)-2...)
Affinity DataIC50:  8.66E+3nM. Assay description: Compound was evaluated for inhibitory activity against human embryonic muscle type Nicotinic acetylcholine receptor specifically delta-subunit expres...
In DepthDetails ArticlePubMed