BDBM50111727 CHEMBL19728::N-(2-Amino-4,6-dimethyl-pyrimidin-5-ylmethyl)-2-(6-methyl-2-oxo-3-phenylmethanesulfonylamino-2H-pyridin-1-yl)-acetamide
SMILES Cc1nc(N)nc(C)c1CNC(=O)Cn1c(C)ccc(NS(=O)(=O)Cc2ccccc2)c1=O
InChI Key InChIKey=WWDLLPDVKDJMAJ-UHFFFAOYSA-N
Data  1 KI
  Tab Delimited (TSV)   2D SDfile   Computed 3D by Vconf -m prep SDfile
Find this compound or compounds like it in BindingDB:
Activity Spreadsheet -- Enzyme Inhibition Constant Data from BindingDB
Found 1 hit for monomerid = 50111727
TargetProthrombin(Homo sapiens (Human))
Corvas International
Curated by ChEMBL
LigandPNGBDBM50111727(CHEMBL19728 | N-(2-Amino-4,6-dimethyl-pyrimidin-5-...)
Affinity DataKi:  281nM. Assay description: In vitro inhibitory constant against human thrombin (FIIa).
In DepthDetails ArticlePubMed