BDBM50111736 CHEMBL19548::N-((4R,5S)-2-Amino-4-methyl-1,4,5,6-tetrahydro-pyrimidin-5-ylmethyl)-2-(6-methyl-2-oxo-3-phenethylamino-2H-pyrazin-1-yl)-acetamide
SMILES C[C@H]1N=C(N)NC[C@H]1CNC(=O)Cn1c(C)cnc(NCCc2ccccc2)c1=O
InChI Key InChIKey=DSURQAVHZVYWOE-NVXWUHKLSA-N
Data  1 KI
  Tab Delimited (TSV)   2D SDfile   Computed 3D by Vconf -m prep SDfile
Find this compound or compounds like it in BindingDB:
Activity Spreadsheet -- Enzyme Inhibition Constant Data from BindingDB
Found 1 hit for monomerid = 50111736
TargetProthrombin(Homo sapiens (Human))
Corvas International
Curated by ChEMBL
LigandPNGBDBM50111736(CHEMBL19548 | N-((4R,5S)-2-Amino-4-methyl-1,4,5,6-...)
Affinity DataKi:  3.20nM. Assay description: In vitro inhibitory constant against human thrombin (FIIa).
In DepthDetails ArticlePubMed