BDBM50112486 4-([3-(3-Carbamimidoyl-phenyl)-allyl]-{4-[1-(1-imino-ethyl)-piperidin-4-yloxy]-3-trifluoromethyl-phenyl}-carbamoyl)-phthalic acid::CHEMBL24263
SMILES CC(=N)N1CCC(CC1)Oc1ccc(cc1C(F)(F)F)N(C\C=C\c1cccc(c1)C(N)=N)C(=O)c1ccc(C(O)=O)c(c1)C(O)=O
InChI Key InChIKey=XZNCKJGAEMMGKU-BOOFMNMKSA-N
Data  3 KI
  Tab Delimited (TSV)   2D SDfile   Computed 3D by Vconf -m prep SDfile
Find this compound or compounds like it in BindingDB:
Activity Spreadsheet -- Enzyme Inhibition Constant Data from BindingDB
Found 3 hits for monomerid = 50112486
TargetCoagulation factor X(Homo sapiens (Human))
Berlex Biosciences
Curated by ChEMBL
LigandPNGBDBM50112486(4-([3-(3-Carbamimidoyl-phenyl)-allyl]-{4-[1-(1-imi...)
Affinity DataKi:  0.560nM. Assay description: Competitive inhibition of coagulation factor Xa
In DepthDetails ArticlePubMed
TargetSerine protease 1(Bos taurus (bovine))
Berlex Biosciences
Curated by ChEMBL
LigandPNGBDBM50112486(4-([3-(3-Carbamimidoyl-phenyl)-allyl]-{4-[1-(1-imi...)
Affinity DataKi:  10nM. Assay description: Competitive inhibition of trypsin
In DepthDetails ArticlePubMed
TargetProthrombin(Homo sapiens (Human))
Berlex Biosciences
Curated by ChEMBL
LigandPNGBDBM50112486(4-([3-(3-Carbamimidoyl-phenyl)-allyl]-{4-[1-(1-imi...)
Affinity DataKi:  3.26E+3nM. Assay description: Competitive inhibition of coagulation factor IIa
In DepthDetails ArticlePubMed