BDBM50112517 3-(3-{2-Ethyl-6-[1-(1-imino-ethyl)-piperidin-4-yloxy]-benzoimidazol-1-yl}-propenyl)-4-methoxy-phenylamine::CHEMBL24915
SMILES CCc1nc2ccc(OC3CCN(CC3)C(C)=N)cc2n1CC=Cc1cc(N)ccc1OC
InChI Key InChIKey=BZFKMFXKXIVGFZ-UHFFFAOYSA-N
Data  3 KI
  Tab Delimited (TSV)   2D SDfile   Computed 3D by Vconf -m prep SDfile
Find this compound or compounds like it in BindingDB:
Activity Spreadsheet -- Enzyme Inhibition Constant Data from BindingDB
Found 3 hits for monomerid = 50112517
TargetCoagulation factor X(Homo sapiens (Human))
Berlex Biosciences
Curated by ChEMBL
LigandPNGBDBM50112517(3-(3-{2-Ethyl-6-[1-(1-imino-ethyl)-piperidin-4-ylo...)
Affinity DataKi:  13nM. Assay description: Tested in vitro for the inhibitory potency against Coagulation factor Xa
In DepthDetails ArticlePubMed
TargetSerine protease 1(Homo sapiens (Human))
Berlex Biosciences
Curated by ChEMBL
LigandPNGBDBM50112517(3-(3-{2-Ethyl-6-[1-(1-imino-ethyl)-piperidin-4-ylo...)
Affinity DataKi:  130nM. Assay description: Tested in vitro for the selectivity against trypsin (Trp)
In DepthDetails ArticlePubMed
TargetProthrombin(Homo sapiens (Human))
Berlex Biosciences
Curated by ChEMBL
LigandPNGBDBM50112517(3-(3-{2-Ethyl-6-[1-(1-imino-ethyl)-piperidin-4-ylo...)
Affinity DataKi:  2.60E+3nM. Assay description: Tested in vitro for the selectivity against thrombin (IIa)
In DepthDetails ArticlePubMed