BDBM50112522 CHEMBL280769::N-{1-(7-Carbamimidoyl-naphthalen-2-ylmethyl)-2-ethyl-5-[1-(1-imino-ethyl)-piperidin-4-yloxy]-1H-benzoimidazol-4-yl}-acetamide
SMILES CCc1nc2c(NC(C)=O)c(OC3CCN(CC3)C(C)=N)ccc2n1Cc1ccc2ccc(cc2c1)C(N)=N
InChI Key InChIKey=IMFOAYUDZBQOFF-UHFFFAOYSA-N
Data  3 KI
  Tab Delimited (TSV)   2D SDfile   Computed 3D by Vconf -m prep SDfile
Find this compound or compounds like it in BindingDB:
Activity Spreadsheet -- Enzyme Inhibition Constant Data from BindingDB
Found 3 hits for monomerid = 50112522
TargetSerine protease 1(Homo sapiens (Human))
Berlex Biosciences
Curated by ChEMBL
LigandPNGBDBM50112522(CHEMBL280769 | N-{1-(7-Carbamimidoyl-naphthalen-2-...)
Affinity DataKi:  25nM. Assay description: Tested in vitro for the selectivity against trypsin (Trp)
In DepthDetails ArticlePubMed
TargetCoagulation factor X(Homo sapiens (Human))
Berlex Biosciences
Curated by ChEMBL
LigandPNGBDBM50112522(CHEMBL280769 | N-{1-(7-Carbamimidoyl-naphthalen-2-...)
Affinity DataKi:  50nM. Assay description: Tested in vitro for the inhibitory potency against Coagulation factor Xa
In DepthDetails ArticlePubMed
TargetProthrombin(Homo sapiens (Human))
Berlex Biosciences
Curated by ChEMBL
LigandPNGBDBM50112522(CHEMBL280769 | N-{1-(7-Carbamimidoyl-naphthalen-2-...)
Affinity DataKi: >5.00E+3nM. Assay description: Tested in vitro for the selectivity against thrombin (IIa)
In DepthDetails ArticlePubMed