BDBM50112567 CHEMBL25087::N-tert-Butyl-N'-(3-methoxy-4-oxazol-5-yl-phenyl)-N-methyl-oxalamide
SMILES COc1cc(NC(=O)C(=O)N(C)C(C)(C)C)ccc1-c1cnco1
InChI Key InChIKey=XAQGNYHTBSUITM-UHFFFAOYSA-N
Data  1 IC50
  Tab Delimited (TSV)   2D SDfile   Computed 3D by Vconf -m prep SDfile
Find this compound or compounds like it in BindingDB:
Activity Spreadsheet -- Enzyme Inhibition Constant Data from BindingDB
Found 1 hit for monomerid = 50112567
TargetInosine-5'-monophosphate dehydrogenase 2(Homo sapiens (Human))
Bristol-Myers Squibb Pharmaceutical Research Institute
Curated by ChEMBL
LigandPNGBDBM50112567(CHEMBL25087 | N-tert-Butyl-N'-(3-methoxy-4-oxazol-...)
Affinity DataIC50: >1.00E+4nM. Assay description: Inhibition of human Inosine-5'-monophosphate dehydrogenase 2
In DepthDetails ArticlePubMed