BDBM50112996 3-(2-{[5-(3-Benzyl-ureido)-furan-2-carbonyl]-amino}-acetylamino)-3-pyridin-3-yl-propionic acid::CHEMBL286266
SMILES OC(=O)CC(NC(=O)CNC(=O)c1ccc(NC(=O)NCc2ccccc2)o1)c1cccnc1
InChI Key InChIKey=UFJUFUWNIIBKKK-UHFFFAOYSA-N
Data  1 IC50
  Tab Delimited (TSV)   2D SDfile   Computed 3D by Vconf -m prep SDfile
Find this compound or compounds like it in BindingDB:
Activity Spreadsheet -- Enzyme Inhibition Constant Data from BindingDB
Found 1 hit for monomerid = 50112996
TargetIntegrin alpha-V/beta-3(Homo sapiens (Human))
Basf
Curated by ChEMBL
LigandPNGBDBM50112996(3-(2-{[5-(3-Benzyl-ureido)-furan-2-carbonyl]-amino...)
Affinity DataIC50:  0.100nM. Assay description: Inhibitory activity against alphaV-beta3 integrin
In DepthDetails ArticlePubMed