BDBM50113320 6-(2-Biphenyl-4-yl-vinyl)-quinoline-2,4-dicarboxylic acid::CHEMBL308094
SMILES OC(=O)c1cc(C(O)=O)c2cc(\C=C\c3ccc(cc3)-c3ccccc3)ccc2n1
InChI Key InChIKey=MQXOORFWCLUCNF-VOTSOKGWSA-N
Data  1 KI
  Tab Delimited (TSV)   2D SDfile   Computed 3D by Vconf -m prep SDfile
Find this compound or compounds like it in BindingDB:
Activity Spreadsheet -- Enzyme Inhibition Constant Data from BindingDB
Found 1 hit for monomerid = 50113320
TargetVesicular glutamate transporter 3(Rattus norvegicus)
The University Of Montana
Curated by ChEMBL
LigandPNGBDBM50113320(6-(2-Biphenyl-4-yl-vinyl)-quinoline-2,4-dicarboxyl...)
Affinity DataKi:  6.40E+4nM. Assay description: Estimated inhibitory conc. against Vesicular glutamate transporter (VGLUT), using Cheng-Prushoff equation
In DepthDetails ArticlePubMed