BDBM50114846 CHEMBL3608883
SMILES COc1ccc(cc1S(N)(=O)=O)-c1cnc(o1)C(=O)N1CCCC1
InChI Key InChIKey=ALGVXPQDJLDXSM-UHFFFAOYSA-N
Data  4 KI
  Tab Delimited (TSV)   2D SDfile   Computed 3D by Vconf -m prep SDfile
Find this compound or compounds like it in BindingDB:
Activity Spreadsheet -- Enzyme Inhibition Constant Data from BindingDB
Found 4 hits for monomerid = 50114846
TargetCarbonic anhydrase 2(Homo sapiens (Human))
Saint Petersburg State University
Curated by ChEMBL
LigandPNGBDBM50114846(CHEMBL3608883)
Affinity DataKi:  0.0100nM. Assay description: Inhibition of human recombinant carbonic anhydrase 2 preincubated for 15 mins by stopped flow CO2 hydration method
In DepthDetails ArticlePubMed
TargetCarbonic anhydrase 9(Homo sapiens (Human))
Saint Petersburg State University
Curated by ChEMBL
LigandPNGBDBM50114846(CHEMBL3608883)
Affinity DataKi:  4.10nM. Assay description: Inhibition of human recombinant carbonic anhydrase 9 preincubated for 15 mins by stopped flow CO2 hydration method
In DepthDetails ArticlePubMed
TargetCarbonic anhydrase 12(Homo sapiens (Human))
Saint Petersburg State University
Curated by ChEMBL
LigandPNGBDBM50114846(CHEMBL3608883)
Affinity DataKi:  8.57E+3nM. Assay description: Inhibition of human recombinant carbonic anhydrase 12 preincubated for 15 mins by stopped flow CO2 hydration method
In DepthDetails ArticlePubMed
TargetCarbonic anhydrase 1(Homo sapiens (Human))
Saint Petersburg State University
Curated by ChEMBL
LigandPNGBDBM50114846(CHEMBL3608883)
Affinity DataKi: >1.00E+4nM. Assay description: Inhibition of human recombinant carbonic anhydrase 1 preincubated for 15 mins by stopped flow CO2 hydration method
In DepthDetails ArticlePubMed