BDBM50114923 CHEMBL3609142
SMILES CCCCCCOc1c(OC)cc2C(CN(C)C3Cc4cc5OCOc5cc4-c1c23)c1ccccc1
InChI Key InChIKey=FESBEMCDUCWSRS-UHFFFAOYSA-N
Data  1 KI
  Tab Delimited (TSV)   2D SDfile   Computed 3D by Vconf -m prep SDfile
Find this compound or compounds like it in BindingDB:
Activity Spreadsheet -- Enzyme Inhibition Constant Data from BindingDB
Found 1 hit for monomerid = 50114923
Target5-hydroxytryptamine receptor 2B(Homo sapiens (Human))
City University Of New York
Curated by ChEMBL
LigandPNGBDBM50114923(CHEMBL3609142)
Affinity DataKi:  663nM. Assay description: Displacement of [3H]LSD from 5HT2B receptor (unknown origin)
In DepthDetails ArticlePubMed