BDBM50115190 CHEMBL3609351
SMILES C(CN1CCC(CC1)c1c[nH]c2ccccc12)Cc1ccccc1
InChI Key InChIKey=GXCYQPSYQZATNO-UHFFFAOYSA-N
Data  2 KI
  Tab Delimited (TSV)   2D SDfile   Computed 3D by Vconf -m prep SDfile
Find this compound or compounds like it in BindingDB:
Activity Spreadsheet -- Enzyme Inhibition Constant Data from BindingDB
Found 2 hits for monomerid = 50115190
TargetAlpha-1B adrenergic receptor(Rattus norvegicus (rat))
Toray Industries
Curated by ChEMBL
LigandPNGBDBM50115190(CHEMBL3609351)
Affinity DataKi:  13nM. Assay description: Displacement of [3H]prazosin from alpha1B adrenoceptor in rat liver membranes
In DepthDetails ArticlePubMed
TargetAlpha-1A adrenergic receptor(Rattus norvegicus (Rat))
Toray Industries
Curated by ChEMBL
LigandPNGBDBM50115190(CHEMBL3609351)
Affinity DataKi:  16nM. Assay description: Displacement of [3H]prazosin from alpha1A adrenoceptor in rat submaxillary gland membrane
In DepthDetails ArticlePubMed