BDBM50115344 4-(6,7-Dimethoxy-quinazolin-4-yl)-piperazine-1-carboxylic acid (4-butyl-phenyl)-amide::CHEMBL450338
SMILES CCCCc1ccc(NC(=O)N2CCN(CC2)c2ncnc3cc(OC)c(OC)cc23)cc1
InChI Key InChIKey=KOUDKWPXLHHVKW-UHFFFAOYSA-N
Data  1 IC50
  Tab Delimited (TSV)   2D SDfile   Computed 3D by Vconf -m prep SDfile
Find this compound or compounds like it in BindingDB:
Activity Spreadsheet -- Enzyme Inhibition Constant Data from BindingDB
Found 1 hit for monomerid = 50115344
TargetPlatelet-derived growth factor receptor beta(Homo sapiens (Human))
Pharmaceutical Research Institute
Curated by ChEMBL
LigandPNGBDBM50115344(4-(6,7-Dimethoxy-quinazolin-4-yl)-piperazine-1-car...)
Affinity DataIC50:  210nM. Assay description: Inhibition of Platelet-derived growth factor receptor beta phosphorylation
In DepthDetails ArticlePubMed