BDBM501155 4-(7- fluoroimidazo [1,2-a]pyridin- 3-yl)-7-((6- (((S)-2- (hydroxymeth- yl)pyrrolidin- 1-yl]methyl)- 5-((R)-THF-3- yl)pyridin-2- yl)amino)isoin- dolin-1-one::US11021481, Compound I-827::US11078201, Compound I-827::US11548890, Compound I-827
SMILES OC[C@@H]1CCCN1Cc1nc(Nc2ccc(c3CNC(=O)c23)-c2cnc3cc(F)ccn23)ccc1[C@H]1CCOC1
InChI Key InChIKey=YQBFAXJDILWENA-ICSRJNTNSA-N
Data  5 IC50
  Tab Delimited (TSV)   2D SDfile   Computed 3D by Vconf -m prep SDfile
Find this compound or compounds like it in BindingDB:
Activity Spreadsheet -- Enzyme Inhibition Constant Data from BindingDB
Found 5 hits for monomerid = 501155
TargetMitogen-activated protein kinase kinase kinase kinase 1(Homo sapiens (Human))
Nimbus Saturn
US Patent
LigandPNGBDBM501155(4-(7- fluoroimidazo [1,2-a]pyridin- 3-yl)-7-((6- (...)
Affinity DataIC50: <100nM. Assay description: HPK1 biochemical enzyme assay: HPK1 enzyme inhibition was measured using a microfluidic mobility shift assay. Reactions were performed in a 384-well ...
Ligand InfoPC cidPC sid
In DepthDetails US Patent
TargetMitogen-activated protein kinase kinase kinase kinase 1(Homo sapiens (Human))
Nimbus Saturn
US Patent
LigandPNGBDBM501155(4-(7- fluoroimidazo [1,2-a]pyridin- 3-yl)-7-((6- (...)
Affinity DataIC50: <100nM. Assay description: HPK1 biochemical enzyme assay: HPK1 enzyme inhibition was measured using a microfluidic mobility shift assay. Reactions were performed in a 384-well ...
Ligand InfoPC cidPC sid
In DepthDetails US Patent
TargetMitogen-activated protein kinase kinase kinase kinase 1(Homo sapiens (Human))
Nimbus Saturn
US Patent
LigandPNGBDBM501155(4-(7- fluoroimidazo [1,2-a]pyridin- 3-yl)-7-((6- (...)
Affinity DataIC50: <100nM. Assay description: HPK1 biochemical enzyme assay: HPK1 enzyme inhibition was measured using a microfluidic mobility shift assay. Reactions were performed in a 384-well ...
Ligand InfoPC cidPC sid
In DepthDetails US Patent
TargetMitogen-activated protein kinase kinase kinase kinase 1(Homo sapiens (Human))
Nimbus Saturn
US Patent
LigandPNGBDBM501155(4-(7- fluoroimidazo [1,2-a]pyridin- 3-yl)-7-((6- (...)
Affinity DataIC50: <100nM. Assay description: HPK1 biochemical enzyme assay: HPK1 enzyme inhibition was measured using a microfluidic mobility shift assay. Reactions were performed in a 384-well ...
Ligand InfoPC cidPC sid
In DepthDetails US Patent
TargetMitogen-activated protein kinase kinase kinase kinase 1(Homo sapiens (Human))
Nimbus Saturn
US Patent
LigandPNGBDBM501155(4-(7- fluoroimidazo [1,2-a]pyridin- 3-yl)-7-((6- (...)
Affinity DataIC50: <100nM. Assay description: HPK1 biochemical enzyme assay: HPK1 enzyme inhibition was measured using a microfluidic mobility shift assay. Reactions were performed in a 384-well ...
Ligand InfoPC cidPC sid
In DepthDetails US Patent