BDBM50116135 CHEMBL68220::N-(3-Methoxy-4-oxazol-5-yl-phenyl)-N',N'-dimethyl-6-phenyl-[1,3,5]triazine-2,4-diamine
SMILES COc1cc(Nc2nc(nc(n2)-c2ccccc2)N(C)C)ccc1-c1cnco1
InChI Key InChIKey=IBWTWYCJJKAGNJ-UHFFFAOYSA-N
Data  1 IC50
  Tab Delimited (TSV)   2D SDfile   Computed 3D by Vconf -m prep SDfile
Find this compound or compounds like it in BindingDB:
Activity Spreadsheet -- Enzyme Inhibition Constant Data from BindingDB
Found 1 hit for monomerid = 50116135
TargetInosine-5'-monophosphate dehydrogenase 2(Homo sapiens (Human))
Bristol-Myers Squibb Pharmaceutical Research Institute
Curated by ChEMBL
LigandPNGBDBM50116135(CHEMBL68220 | N-(3-Methoxy-4-oxazol-5-yl-phenyl)-N...)
Affinity DataIC50:  270nM. Assay description: Inhibition of human Inosine-5'-monophosphate dehydrogenase 2
In DepthDetails ArticlePubMed