BDBM50116146 (4-Benzyloxy-6-phenyl-[1,3,5]triazin-2-yl)-(3-methoxy-4-oxazol-5-yl-phenyl)-amine::CHEMBL303048
SMILES COc1cc(Nc2nc(OCc3ccccc3)nc(n2)-c2ccccc2)ccc1-c1cnco1
InChI Key InChIKey=ZXYOLSHRFNIZNS-UHFFFAOYSA-N
Data  1 IC50
  Tab Delimited (TSV)   2D SDfile   Computed 3D by Vconf -m prep SDfile
Find this compound or compounds like it in BindingDB:
Activity Spreadsheet -- Enzyme Inhibition Constant Data from BindingDB
Found 1 hit for monomerid = 50116146
TargetInosine-5'-monophosphate dehydrogenase 2(Homo sapiens (Human))
Bristol-Myers Squibb Pharmaceutical Research Institute
Curated by ChEMBL
LigandPNGBDBM50116146((4-Benzyloxy-6-phenyl-[1,3,5]triazin-2-yl)-(3-meth...)
Affinity DataIC50:  32nM. Assay description: Inhibition of human Inosine-5'-monophosphate dehydrogenase 2
In DepthDetails ArticlePubMed