BDBM50116273 CHEMBL306862::N-(2-Aminomethyl-3H-benzoimidazol-5-yl)-2-benzyloxy-benzamide
SMILES NCc1nc2ccc(NC(=O)c3ccccc3OCc3ccccc3)cc2[nH]1
InChI Key InChIKey=UQFUGRDEFSIYQL-UHFFFAOYSA-N
Data  1 IC50
  Tab Delimited (TSV)   2D SDfile   Computed 3D by Vconf -m prep SDfile
Find this compound or compounds like it in BindingDB:
Activity Spreadsheet -- Enzyme Inhibition Constant Data from BindingDB
Found 1 hit for monomerid = 50116273
TargetMatrix metalloproteinase-9(Mus musculus)
University Of California
Curated by ChEMBL
LigandPNGBDBM50116273(CHEMBL306862 | N-(2-Aminomethyl-3H-benzoimidazol-5...)
Affinity DataIC50:  4.80E+4nM. Assay description: Inhibitory concentration was determined against murine gelatinase B
In DepthDetails ArticlePubMed