BDBM50116283 (2-Benzyloxy-benzyl)-(2-methyl-1H-benzoimidazol-5-yl)-amine::CHEMBL71250
SMILES Cc1nc2ccc(NCc3ccccc3OCc3ccccc3)cc2[nH]1
InChI Key InChIKey=XNPKOYKHRYUIPH-UHFFFAOYSA-N
Data  1 IC50
  Tab Delimited (TSV)   2D SDfile   Computed 3D by Vconf -m prep SDfile
Find this compound or compounds like it in BindingDB:
Activity Spreadsheet -- Enzyme Inhibition Constant Data from BindingDB
Found 1 hit for monomerid = 50116283
TargetMatrix metalloproteinase-9(Mus musculus)
University Of California
Curated by ChEMBL
LigandPNGBDBM50116283((2-Benzyloxy-benzyl)-(2-methyl-1H-benzoimidazol-5-...)
Affinity DataIC50: >3.00E+5nM. Assay description: Inhibitory concentration was determined against murine gelatinase B
In DepthDetails ArticlePubMed