BDBM50116599 CHEMBL119726::Morpholine-4-carboxylic acid (9-isopropyl-2,4-dimethyl-9H-carbazol-3-yl)-amide
SMILES CC(C)n1c2ccccc2c2c(C)c(NC(=O)N3CCOCC3)c(C)cc12
InChI Key InChIKey=BHTJQQZHOZWIRO-UHFFFAOYSA-N
Data  1 IC50
  Tab Delimited (TSV)   2D SDfile   Computed 3D by Vconf -m prep SDfile
Find this compound or compounds like it in BindingDB:
Activity Spreadsheet -- Enzyme Inhibition Constant Data from BindingDB
Found 1 hit for monomerid = 50116599
TargetNeuropeptide Y receptor type 5(Homo sapiens (Human))
Astrazeneca
Curated by ChEMBL
LigandPNGBDBM50116599(CHEMBL119726 | Morpholine-4-carboxylic acid (9-iso...)
Affinity DataIC50:  390nM. Assay description: Binding affinity to the human Neuropeptide Y receptor Y5 (NPY5)
In DepthDetails ArticlePubMed