BDBM50116609 CHEMBL119426::Morpholine-4-carboxylic acid [9-(2,2-dimethyl-propyl)-9H-carbazol-3-yl]-amide
SMILES CC(C)(C)Cn1c2ccccc2c2cc(NC(=O)N3CCOCC3)ccc12
InChI Key InChIKey=MWXNDJFIIHASJJ-UHFFFAOYSA-N
Data  1 IC50
  Tab Delimited (TSV)   2D SDfile   Computed 3D by Vconf -m prep SDfile
Find this compound or compounds like it in BindingDB:
Activity Spreadsheet -- Enzyme Inhibition Constant Data from BindingDB
Found 1 hit for monomerid = 50116609
TargetNeuropeptide Y receptor type 5(Homo sapiens (Human))
Astrazeneca
Curated by ChEMBL
LigandPNGBDBM50116609(CHEMBL119426 | Morpholine-4-carboxylic acid [9-(2,...)
Affinity DataIC50:  78nM. Assay description: Binding affinity to the human Neuropeptide Y receptor Y5 (NPY5)
In DepthDetails ArticlePubMed