BDBM50116617 CHEMBL116210::N-(9-Acetyl-9H-carbazol-3-yl)-3-pyridin-4-yl-propionamide
SMILES CC(=O)n1c2ccccc2c2cc(NC(=O)CCc3ccncc3)ccc12
InChI Key InChIKey=BLJIZWQCQUDUGF-UHFFFAOYSA-N
Data  1 IC50
  Tab Delimited (TSV)   2D SDfile   Computed 3D by Vconf -m prep SDfile
Find this compound or compounds like it in BindingDB:
Activity Spreadsheet -- Enzyme Inhibition Constant Data from BindingDB
Found 1 hit for monomerid = 50116617
TargetNeuropeptide Y receptor type 5(Homo sapiens (Human))
Astrazeneca
Curated by ChEMBL
LigandPNGBDBM50116617(CHEMBL116210 | N-(9-Acetyl-9H-carbazol-3-yl)-3-pyr...)
Affinity DataIC50:  3nM. Assay description: Binding affinity to the human Neuropeptide Y receptor Y5 (NPY5)
In DepthDetails ArticlePubMed