BDBM50116884 CHEMBL3612936
SMILES [H][C@]12C[C@]1([C@@H](O)[C@@H](O)[C@@H]2n1cnc2c(NC3CCC3)nc(nc12)C#Cc1ccc(Cl)s1)C(=O)NC
InChI Key InChIKey=YDOKJMSQIQAPID-VYYPKGNMSA-N
Data  1 KI
  Tab Delimited (TSV)   2D SDfile   Computed 3D by Vconf -m prep SDfile
Find this compound or compounds like it in BindingDB:
Activity Spreadsheet -- Enzyme Inhibition Constant Data from BindingDB
Found 1 hit for monomerid = 50116884
TargetAdenosine receptor A3(Homo sapiens (Human))
National Institute Of Diabetes And Digestive And Kidney Diseases
Curated by ChEMBL
LigandPNGBDBM50116884(CHEMBL3612936)
Affinity DataKi:  4.5nM. Assay description: Displacement of [125I]N6-(4-amino-3-iodobenzyl)adenosine-5'-N-methyluronamide from human adenosine A3 receptor expressed in CHO cell membranes
In DepthDetails ArticlePubMed