BDBM50116986 AcQITWV-OH::CHEMBL2369910
SMILES CC[C@H](C)[C@H](NC(=O)[C@H](CCC(N)=O)NC(C)=O)C(=O)N[C@@H]([C@@H](C)O)C(=O)N[C@@H](Cc1c[nH]c2ccccc12)C(=O)N[C@@H](C(C)C)C(O)=O
InChI Key InChIKey=XVJGICGFGWOUKL-RMPAAVFOSA-N
Data  1 IC50
  Tab Delimited (TSV)   2D SDfile   Computed 3D by Vconf -m prep SDfile
Find this compound or compounds like it in BindingDB:
Activity Spreadsheet -- Enzyme Inhibition Constant Data from BindingDB
Found 1 hit for monomerid = 50116986
LigandPNGBDBM50116986(AcQITWV-OH | CHEMBL2369910)
Affinity DataIC50:  4.50E+3nM. Assay description: Inhibitory concentration for MAGI-3 PDZ2 domain
In DepthDetails ArticlePubMed