BDBM50117168 CHEMBL121391::N*5*-(3-Bromo-benzyl)-N*5*-methyl-6-(6-morpholin-4-yl-pyridin-3-ylethynyl)-pyrimidine-4,5-diamine
SMILES CN(Cc1cccc(Br)c1)c1c(N)ncnc1C#Cc1ccc(nc1)N1CCOCC1
InChI Key InChIKey=DUKUPYWBYWVDHG-UHFFFAOYSA-N
Data  1 IC50
  Tab Delimited (TSV)   2D SDfile   Computed 3D by Vconf -m prep SDfile
Find this compound or compounds like it in BindingDB:
Activity Spreadsheet -- Enzyme Inhibition Constant Data from BindingDB
Found 1 hit for monomerid = 50117168
TargetAdenosine kinase(Rattus norvegicus (rat))
Abbott Laboratories
Curated by ChEMBL
LigandPNGBDBM50117168(CHEMBL121391 | N*5*-(3-Bromo-benzyl)-N*5*-methyl-6...)
Affinity DataIC50:  5nM. Assay description: Evaluated in vitro for inhibitory activity against Adenosine kinase (AK)
In DepthDetails ArticlePubMed