BDBM50117657 CHEMBL3613702
SMILES Fc1cc(Nc2ncnc3ccc(NC(=O)C=C)cc23)cc(Cl)c1Cl
InChI Key InChIKey=GGBRHDVTKTXRBX-UHFFFAOYSA-N
Data  1 IC50
  Tab Delimited (TSV)   2D SDfile   Computed 3D by Vconf -m prep SDfile
Find this compound or compounds like it in BindingDB:
Activity Spreadsheet -- Enzyme Inhibition Constant Data from BindingDB
Found 1 hit for monomerid = 50117657
TargetEpidermal growth factor receptor(Homo sapiens (Human))
Jazan University
Curated by ChEMBL
LigandPNGBDBM50117657(CHEMBL3613702)
Affinity DataIC50:  0.0370nM. Assay description: Inhibition of epidermal growth factor receptor kinase (unknown origin) using [33P]-ATP after 20 to 30 mins by radiometric assay
In DepthDetails ArticlePubMed