BDBM50118218 CHEMBL131271::Disodium 1-amino-4-[4-(4,6-dichloro-[1,3,5]triazine-2-ylamino)-3-sulfophenylamino]-9,10-dioxo-9,10-di-hydroanthracene-2-sulfonate::MG 40-1
SMILES Nc1c(cc(Nc2ccc(Nc3nc(Cl)nc(Cl)n3)c(c2)S([O-])(=O)=O)c2C(=O)c3ccccc3C(=O)c12)S([O-])(=O)=O
InChI Key InChIKey=WMMDLLKMVKWKIP-UHFFFAOYSA-L
Data  1 KI  3 IC50
  Tab Delimited (TSV)   2D SDfile   Computed 3D by Vconf -m prep SDfile
Find this compound or compounds like it in BindingDB:
Activity Spreadsheet -- Enzyme Inhibition Constant Data from BindingDB
Found 4 hits for monomerid = 50118218
TargetP2Y purinoceptor 12(Homo sapiens (Human))
University Of Bonn
Curated by ChEMBL
LigandPNGBDBM50118218(CHEMBL131271 | Disodium 1-amino-4-[4-(4,6-dichloro...)
Affinity DataKi:  2.45E+3nM. Assay description: Displacement of [3H]PSB0413 from human platelet P2Y12 receptor
In DepthDetails ArticlePubMed
TargetP2X purinoceptor 2(RAT)
University Of Bonn
Curated by ChEMBL
LigandPNGBDBM50118218(CHEMBL131271 | Disodium 1-amino-4-[4-(4,6-dichloro...)
Affinity DataIC50:  1.16E+3nM. Assay description: Antagonist activity against rat P2X2 receptor expressed in Xenopus laevis oocyte assessed as inhibition of alpha, beta-meATP-induced inward current b...
In DepthDetails ArticlePubMed
TargetP2X purinoceptor 4(RAT)
University Of Bonn
Curated by ChEMBL
LigandPNGBDBM50118218(CHEMBL131271 | Disodium 1-amino-4-[4-(4,6-dichloro...)
Affinity DataIC50: >1.00E+4nM. Assay description: Antagonist activity against rat P2X4 receptor expressed in Xenopus laevis oocyte assessed as inhibition of alpha, beta-meATP-induced inward current b...
In DepthDetails ArticlePubMed
TargetP2X purinoceptor 1(RAT)
National Institute Of Diabetes
Curated by ChEMBL
LigandPNGBDBM50118218(CHEMBL131271 | Disodium 1-amino-4-[4-(4,6-dichloro...)
Affinity DataIC50:  8.80E+3nM. Assay description: The compound was evaluated for antagonist activity against P2X purinoceptor 1 (P2X1) like receptor from rat vas deferens
In DepthDetails ArticlePubMed