BDBM50119034 (E)-N-(3-Methoxy-4-oxazol-5-yl-phenyl)-3-(2-methoxy-phenyl)-acrylamide::CHEMBL319883
SMILES COc1ccccc1\C=C\C(=O)Nc1ccc(-c2cnco2)c(OC)c1
InChI Key InChIKey=VFGJGRZUOZEJBZ-JXMROGBWSA-N
Data  1 IC50
  Tab Delimited (TSV)   2D SDfile   Computed 3D by Vconf -m prep SDfile
Find this compound or compounds like it in BindingDB:
Activity Spreadsheet -- Enzyme Inhibition Constant Data from BindingDB
Found 1 hit for monomerid = 50119034
TargetInosine-5'-monophosphate dehydrogenase 2(Homo sapiens (Human))
Bristol-Myers Squibb Pri
Curated by ChEMBL
LigandPNGBDBM50119034((E)-N-(3-Methoxy-4-oxazol-5-yl-phenyl)-3-(2-methox...)
Affinity DataIC50:  110nM. Assay description: Inhibitory activity of compound was evaluated against the Inosine-5'-monophosphate dehydrogenase 2
In DepthDetails ArticlePubMed