BDBM50119510 CHEMBL221129
SMILES CCCc1c(nnn1Cc1ccccc1Br)C(=O)NCCCCCN1CCN(CC1)c1ccccc1OC
InChI Key InChIKey=FLQHAMHLQRATPW-UHFFFAOYSA-N
Data  2 KI
  Tab Delimited (TSV)   2D SDfile   Computed 3D by Vconf -m prep SDfile
Find this compound or compounds like it in BindingDB:
Activity Spreadsheet -- Enzyme Inhibition Constant Data from BindingDB
Found 2 hits for monomerid = 50119510
TargetD(2) dopamine receptor(Homo sapiens (Human))
Friedrich-Alexander University
Curated by ChEMBL
LigandPNGBDBM50119510(CHEMBL221129)
Affinity DataKi:  0.910nM. Assay description: Displacement of [3H]spiperone from human dopamine D2L receptor expressed in CHO cell membranes by radioligand competition binding assay
In DepthDetails ArticlePubMed
Target5-hydroxytryptamine receptor 2A(Homo sapiens (Human))
Friedrich-Alexander University
Curated by ChEMBL
LigandPNGBDBM50119510(CHEMBL221129)
Affinity DataKi:  62nM. Assay description: Displacement of [3H]ketanserin from human 5-HT2A receptor expressed in HEK293 cell membranes by radioligand competition binding assay
In DepthDetails ArticlePubMed