BDBM50120809 8-Benzyl-2-phenyl-6,7,8,9-tetrahydro-5H-1,3a,5,8-tetraaza-cyclopenta[a]naphthalen-4-one::CHEMBL148740
SMILES O=c1[nH]c2CCN(Cc3ccccc3)Cc2c2nc(cn12)-c1ccccc1
InChI Key InChIKey=DMBQCSRARMDJRI-UHFFFAOYSA-N
Data  2 EC50
  Tab Delimited (TSV)   2D SDfile   Computed 3D by Vconf -m prep SDfile
Find this compound or compounds like it in BindingDB:
Activity Spreadsheet -- Enzyme Inhibition Constant Data from BindingDB
Found 2 hits for monomerid = 50120809
TargetGamma-aminobutyric acid receptor subunit alpha-2(Homo sapiens (Human))
Neurogen
Curated by ChEMBL
LigandPNGBDBM50120809(8-Benzyl-2-phenyl-6,7,8,9-tetrahydro-5H-1,3a,5,8-t...)
Affinity DataEC50:  184nM. Assay description: Effective concentration against gamma-aminobutyric acid (GABA) A receptor, alpha 2
In DepthDetails ArticlePubMed
TargetGamma-aminobutyric acid receptor subunit alpha-1(Homo sapiens (Human))
Neurogen
Curated by ChEMBL
LigandPNGBDBM50120809(8-Benzyl-2-phenyl-6,7,8,9-tetrahydro-5H-1,3a,5,8-t...)
Affinity DataEC50:  17nM. Assay description: Effective concentration against gamma-aminobutyric acid (GABA) A receptor, alpha 1
In DepthDetails ArticlePubMed