BDBM50120823 CHEMBL1904421
SMILES Cc1ccc(O)c(Cc2cc(C)cc(Cc3cc(C)ccc3O)c2O)c1
InChI Key InChIKey=MAQOZOILPAMFSW-UHFFFAOYSA-N
Data  1 IC50
  Tab Delimited (TSV)   2D SDfile   Computed 3D by Vconf -m prep SDfile
Find this compound or compounds like it in BindingDB:
Activity Spreadsheet -- Enzyme Inhibition Constant Data from BindingDB
Found 1 hit for monomerid = 50120823
TargetAlpha-amylase 1A(Homo sapiens (Human))
Freie Universit£T Berlin
Curated by ChEMBL
LigandPNGBDBM50120823(CHEMBL1904421)
Affinity DataIC50:  2.00E+5nM. Assay description: Inhibition of human salivary alpha-amylase using GalG2CNP as substrate by UV-Vis spectrophotometric analysis
In DepthDetails ArticlePubMed