BDBM50120831 CHEMBL3618482
SMILES CN(C)c1ccc(Nc2nc(cs2)-c2ccc(O)cc2O)cc1
InChI Key InChIKey=ODIPDNKSGGZOKP-UHFFFAOYSA-N
Data  1 IC50
  Tab Delimited (TSV)   2D SDfile   Computed 3D by Vconf -m prep SDfile
Find this compound or compounds like it in BindingDB:
Activity Spreadsheet -- Enzyme Inhibition Constant Data from BindingDB
Found 1 hit for monomerid = 50120831
TargetAlpha-amylase 1A(Homo sapiens (Human))
Freie Universit£T Berlin
Curated by ChEMBL
LigandPNGBDBM50120831(CHEMBL3618482)
Affinity DataIC50:  1.00E+5nM. Assay description: Inhibition of human salivary alpha-amylase using GalG2CNP as substrate by UV-Vis spectrophotometric analysis
In DepthDetails ArticlePubMed