BDBM50121506 (2R,3R,4R,5R)-3,4-Dihydroxy-2,5-bis-(3'-nitro-biphenyl-4-ylmethoxy)-hexanedioic acid bis-[((S)-2-methyl-1-methylcarbamoyl-propyl)-amide]::3,4-Dihydroxy-2,5-bis-(3'-nitro-biphenyl-4-ylmethoxy)-hexanedioic acid bis-[(2-methyl-1-methylcarbamoyl-propyl)-amide]::CHEMBL264815
SMILES CNC(=O)[C@@H](NC(=O)[C@H](OCc1ccc(cc1)-c1cccc(c1)[N+]([O-])=O)[C@H](O)[C@@H](O)[C@@H](OCc1ccc(cc1)-c1cccc(c1)[N+]([O-])=O)C(=O)N[C@@H](C(C)C)C(=O)NC)C(C)C
InChI Key InChIKey=GNZIXCJETYMUQA-OYEZVYLDSA-N
Data  1 KI  1 Kd  1 Koff  1 Kon
  Tab Delimited (TSV)   2D SDfile   Computed 3D by Vconf -m prep SDfile
Find this compound or compounds like it in BindingDB:
Activity Spreadsheet -- Enzyme Inhibition Constant Data from BindingDB
Found 2 hits for monomerid = 50121506
TargetGag-Pol polyprotein [489-587](Human immunodeficiency virus type 1)
Uppsala University
Curated by ChEMBL
LigandPNGBDBM50121506((2R,3R,4R,5R)-3,4-Dihydroxy-2,5-bis-(3'-nitro-biph...)
Affinity DataKi:  1.40nM Kd:  18nM Koff:  1.81E+5s-1Assay Description:Association rate constant for the interaction between inhibitor and HIV-1 protease
In DepthDetails ArticlePubMed
TargetGag-Pol polyprotein [489-587](Human immunodeficiency virus type 1)
Uppsala University
Curated by ChEMBL
LigandPNGBDBM50121506((2R,3R,4R,5R)-3,4-Dihydroxy-2,5-bis-(3'-nitro-biph...)
Affinity DataKon:  0.000817M-1s-1Assay Description:Association rate constant for the interaction between inhibitor and HIV-1 protease
In DepthDetails ArticlePubMed