BDBM50121817 CHEMBL437149::[Trp11]orexin-B
SMILES CC[C@H](C)[C@H](NC(=O)[C@H](CC(C)C)NC(=O)[C@@H](NC(=O)[C@@H](N)CCSC)[C@@H](C)O)C(=O)NCC(=O)N[C@@H](C)C(=O)N[C@@H](C)C(=O)N[C@@H](Cc1cnc[nH]1)C(=O)N[C@@H](CC(N)=O)C(=O)NCC(=O)N[C@@H](CO)C(=O)N[C@@H](C)C(=O)N[C@@H](CCC(N)=O)C(=O)N[C@@H](CC(C)C)C(=O)N[C@@H](CC(C)C)C(=O)N[C@@H](CCCN=C(N)N)C(=O)N[C@@H](CCC(N)=O)C(=O)N[C@@H](Cc1c[nH]c2ccccc12)C(=O)N[C@@H](CCCN=C(N)N)C(=O)NCC(=O)N[C@@H](CCC(N)=O)C(=O)N[C@@H](CC(C)C)C(=O)NCC(=O)N1CCC[C@H]1C(=O)N1CCC[C@H]1C(=O)NCC(=O)N[C@@H](CO)C(=O)N[C@@H](CCCN=C(N)N)C(N)=O
InChI Key InChIKey=AACMUARQDPOIFF-JXHOBYDLSA-N
Data  2 EC50
  Tab Delimited (TSV)   2D SDfile   Computed 3D by Vconf -m prep SDfile
Find this compound or compounds like it in BindingDB:
Activity Spreadsheet -- Enzyme Inhibition Constant Data from BindingDB
Found 2 hits for monomerid = 50121817
TargetOrexin/Hypocretin receptor type 1(Homo sapiens (Human))
Banyu Tsukuba Research Institute
Curated by ChEMBL
LigandPNGBDBM50121817(CHEMBL437149 | [Trp11]orexin-B)
Affinity DataEC50:  4.80nM. Assay description: Agonist activity against human orexin 1 receptor; EC50; nM
In DepthDetails ArticlePubMed
TargetOrexin receptor type 2(Homo sapiens (Human))
Banyu Tsukuba Research Institute
Curated by ChEMBL
LigandPNGBDBM50121817(CHEMBL437149 | [Trp11]orexin-B)
Affinity DataEC50:  0.150nM. Assay description: Agonist activity against human orexin 2 receptor; EC50; nM
In DepthDetails ArticlePubMed