BDBM50121926 1-[2-(1-Carboxy-ethylamino)-propionyl]-pyrrolidine-2-carboxylic acid::CHEMBL152758
SMILES CC(N[C@H](C)C(=O)N1CCC[C@H]1C(O)=O)C(O)=O
InChI Key InChIKey=HLBPRUWPRRRMCK-QUFPSDLASA-N
Data  2 IC50
  Tab Delimited (TSV)   2D SDfile   Computed 3D by Vconf -m prep SDfile
Find this compound or compounds like it in BindingDB:
Activity Spreadsheet -- Enzyme Inhibition Constant Data from BindingDB
Found 2 hits for monomerid = 50121926
TargetAngiotensin-converting enzyme(Homo sapiens (Human))
Merck Research Laboratories
Curated by ChEMBL
LigandPNGBDBM50121926(1-[2-(1-Carboxy-ethylamino)-propionyl]-pyrrolidine...)
Affinity DataIC50:  90nM. Assay description: Inhibition of Angiotensin I converting enzyme (ACE) in Bothrops jararaca venom
In DepthDetails ArticlePubMed
TargetAngiotensin-converting enzyme(Homo sapiens (Human))
Merck Research Laboratories
Curated by ChEMBL
LigandPNGBDBM50121926(1-[2-(1-Carboxy-ethylamino)-propionyl]-pyrrolidine...)
Affinity DataIC50:  90nM. Assay description: Inhibition of Angiotensin I converting enzyme
In DepthDetails ArticlePubMed