BDBM50121927 CHEMBL437713::Glu-Ser-OctSer-phe-Leu-Ser-Pro-Glu-Arg-Val_Gln-Gln-Arg-Lys-Glu Ser-Lys-Lys-Pro-Pro-Pro-Ala-Lya-Leu-Gln-Pro-Arg
SMILES CCCCCCCC(=O)OC[C@H](NC(=O)[C@H](CO)NC(=O)CN)C(=O)N[C@@H](Cc1ccccc1)C(=O)N[C@@H](CC(C)C)C(=O)N[C@@H](CO)C(=O)N1CCC[C@H]1C(=O)N[C@@H](CCC(O)=O)C(=O)N[C@@H](Cc1cnc[nH]1)C(=O)N[C@@H](CCC(N)=O)C(=O)N[C@@H](CCCNC(N)=N)C(=O)N[C@@H](C(C)C)C(=O)N[C@@H](CCC(N)=O)C(=O)N[C@@H](CCC(N)=O)C(=O)N[C@@H](CCCNC(N)=N)C(=O)N[C@@H](CCCCN)C(=O)N[C@@H](CCC(O)=O)C(=O)N[C@@H](CO)C(=O)N[C@@H](CCCCN)C(=O)N[C@@H](CCCCN)C(=O)N1CCC[C@H]1C(=O)N1CCC[C@H]1C(=O)N1CCC[C@H]1C(=O)N[C@@H](C)C(=O)N[C@@H](CCCCN)C(=O)N[C@@H](CC(C)C)C(=O)N[C@@H](CCC(N)=O)C(=O)N1CCC[C@H]1C(=O)N[C@@H](CCCNC(N)=N)C(O)=O
InChI Key InChIKey=FKZFOVJQJIMDRL-FHUIQSEDSA-N
Data  1 IC50
  Tab Delimited (TSV)   2D SDfile   Computed 3D by Vconf -m prep SDfile
Find this compound or compounds like it in BindingDB:
Activity Spreadsheet -- Enzyme Inhibition Constant Data from BindingDB
Found 1 hit for monomerid = 50121927
TargetGrowth hormone secretagogue receptor type 1(Homo sapiens (Human))
Merck Research Laboratories
Curated by ChEMBL
LigandPNGBDBM50121927(CHEMBL437713 | Glu-Ser-OctSer-phe-Leu-Ser-Pro-Glu-...)
Affinity DataIC50:  0.710nM. Assay description: Ability to displace [125I]ghrelin from cloned human Growth hormone secretagogue receptor type I (GSH1a) expressed in COS-7 cells
In DepthDetails ArticlePubMed