BDBM50122027 3-Methoxy-N-{4-[4-(2-methoxy-phenyl)-piperazin-1-yl]-butyl}-benzamide::CHEMBL152159
SMILES COc1cccc(c1)C(=O)NCCCCN1CCN(CC1)c1ccccc1OC
InChI Key InChIKey=MPUAIZDJLBYYSS-UHFFFAOYSA-N
Data  4 KI
  Tab Delimited (TSV)   2D SDfile   Computed 3D by Vconf -m prep SDfile
Find this compound or compounds like it in BindingDB:
Activity Spreadsheet -- Enzyme Inhibition Constant Data from BindingDB
Found 4 hits for monomerid = 50122027
TargetD(3) dopamine receptor(Rattus norvegicus (Rat))
Universit£
Curated by ChEMBL
LigandPNGBDBM50122027(3-Methoxy-N-{4-[4-(2-methoxy-phenyl)-piperazin-1-y...)
Affinity DataKi:  1.70nM. Assay description: Binding affinity towards Dopamine receptor D3 of rat using [3H]spiroperidol as radioligand
In DepthDetails ArticlePubMed
TargetD(4) dopamine receptor(Homo sapiens (Human))
Universit£
Curated by ChEMBL
LigandPNGBDBM50122027(3-Methoxy-N-{4-[4-(2-methoxy-phenyl)-piperazin-1-y...)
Affinity DataKi:  3.10nM. Assay description: Binding affinity towards human Dopamine receptor D4 using [3H]spiroperidol as radioligand
In DepthDetails ArticlePubMed
Target5-hydroxytryptamine receptor 1A(Rattus norvegicus (rat))
Universit£
Curated by ChEMBL
LigandPNGBDBM50122027(3-Methoxy-N-{4-[4-(2-methoxy-phenyl)-piperazin-1-y...)
Affinity DataKi:  7.5nM. Assay description: Binding affinity towards 5-hydroxytryptamine 1A receptor from rat hippocampal membranes
In DepthDetails ArticlePubMed
TargetD(2) dopamine receptor(Homo sapiens (Human))
Universit£
Curated by ChEMBL
LigandPNGBDBM50122027(3-Methoxy-N-{4-[4-(2-methoxy-phenyl)-piperazin-1-y...)
Affinity DataKi:  680nM. Assay description: Binding affinity towards human Dopamine receptor D2 using [3H]spiroperidol as radioligand
In DepthDetails ArticlePubMed