BDBM50122552 CHEMBL3622508
SMILES CCN(C)C(=O)c1ccc(CNc2ncnc(n2)N2CCc3ccccc3C2)cc1
InChI Key InChIKey=HSGBWBKWOOWYRP-UHFFFAOYSA-N
Data  1 IC50
  Tab Delimited (TSV)   2D SDfile   Computed 3D by Vconf -m prep SDfile
Find this compound or compounds like it in BindingDB:
Activity Spreadsheet -- Enzyme Inhibition Constant Data from BindingDB
Found 1 hit for monomerid = 50122552
TargetA disintegrin and metalloproteinase with thrombospondin motifs 4(Homo sapiens (Human))
Glaxosmithkline
Curated by ChEMBL
LigandPNGBDBM50122552(CHEMBL3622508)
Affinity DataIC50:  1.70E+3nM. Assay description: Inhibition of recombinant human ADAMTS4 (213 to 575 amino acid residues) using WAAG-3R as substrate preincubated for 15 mins followed by substrate ad...
In DepthDetails ArticlePubMed