BDBM50122809 3-(2-{4-[1-(4-Fluoro-phenyl)-5-(1-methyl-1H-[1,2,4]triazol-3-yl)-1H-indol-3-yl]-piperidin-1-yl}-ethyl)-1-methyl-pyrrolidin-2-one::CHEMBL97333
SMILES CN1CCC(CCN2CCC(CC2)c2cn(-c3ccc(F)cc3)c3ccc(cc23)-c2ncn(C)n2)C1=O
InChI Key InChIKey=NLEVDCFBQNJLSW-UHFFFAOYSA-N
Data  11 KI
  Tab Delimited (TSV)   2D SDfile   Computed 3D by Vconf -m prep SDfile
Find this compound or compounds like it in BindingDB:
Activity Spreadsheet -- Enzyme Inhibition Constant Data from BindingDB
Found 11 hits for monomerid = 50122809
TargetAlpha-1A adrenergic receptor(CALF)
H. Lundbeck
Curated by ChEMBL
LigandPNGBDBM50122809(3-(2-{4-[1-(4-Fluoro-phenyl)-5-(1-methyl-1H-[1,2,4...)
Affinity DataKi:  2.20nM. Assay description: Displacement of [3H]prazosin (0.3 nM) from bovine Alpha-1A adrenergic receptor expressed in BHK cells
In DepthDetails ArticlePubMed
TargetAlpha-1B adrenergic receptor(C.H.O.)
H. Lundbeck
Curated by ChEMBL
LigandPNGBDBM50122809(3-(2-{4-[1-(4-Fluoro-phenyl)-5-(1-methyl-1H-[1,2,4...)
Affinity DataKi:  8.80nM. Assay description: Displacement of [3H]prazosin (0.5 nM) from hamster Alpha-1B adrenergic receptor expressed in rat-1 cells
In DepthDetails ArticlePubMed
TargetAlpha-1D adrenergic receptor(Rattus norvegicus (Rat))
H. Lundbeck
Curated by ChEMBL
LigandPNGBDBM50122809(3-(2-{4-[1-(4-Fluoro-phenyl)-5-(1-methyl-1H-[1,2,4...)
Affinity DataKi:  15nM. Assay description: Displacement of [3H]prazosin (0.3 nM) from rat Alpha-1D adrenergic receptor expressed in CHO cells
In DepthDetails ArticlePubMed
Target5-hydroxytryptamine receptor 1A(Homo sapiens (Human))
H. Lundbeck
Curated by ChEMBL
LigandPNGBDBM50122809(3-(2-{4-[1-(4-Fluoro-phenyl)-5-(1-methyl-1H-[1,2,4...)
Affinity DataKi:  64nM. Assay description: Ability to displace [3H]5-CT (2.0 nM) from HeLa cells of human 5-hydroxytryptamine 1A receptor
In DepthDetails ArticlePubMed
Target5-hydroxytryptamine receptor 1B(Homo sapiens (Human))
H. Lundbeck
Curated by ChEMBL
LigandPNGBDBM50122809(3-(2-{4-[1-(4-Fluoro-phenyl)-5-(1-methyl-1H-[1,2,4...)
Affinity DataKi:  100nM. Assay description: Ability to displace [3H]5-CT (1.5 nM) from HeLa cells of human 5-hydroxytryptamine 1B receptor
In DepthDetails ArticlePubMed
Target5-hydroxytryptamine receptor 2A(Rattus norvegicus (rat))
H. Lundbeck
Curated by ChEMBL
LigandPNGBDBM50122809(3-(2-{4-[1-(4-Fluoro-phenyl)-5-(1-methyl-1H-[1,2,4...)
Affinity DataKi:  320nM. Assay description: Displacement of [3H]ketanserin (0.5 nM) from rat cerebral cortex 5-hydroxytryptamine 2A receptors
In DepthDetails ArticlePubMed
TargetD(2) dopamine receptor(Rattus norvegicus (rat))
H. Lundbeck
Curated by ChEMBL
LigandPNGBDBM50122809(3-(2-{4-[1-(4-Fluoro-phenyl)-5-(1-methyl-1H-[1,2,4...)
Affinity DataKi:  540nM. Assay description: Displacement of [3H]spiperone (0.5 nM) from rat corpus striatum dopamine D2 receptor
In DepthDetails ArticlePubMed
Target5-hydroxytryptamine receptor 2C(Homo sapiens (Human))
H. Lundbeck
Curated by ChEMBL
LigandPNGBDBM50122809(3-(2-{4-[1-(4-Fluoro-phenyl)-5-(1-methyl-1H-[1,2,4...)
Affinity DataKi: >4.20E+3nM. Assay description: Ability to displace [3H]mesulergine (0.5 nM) from CHO cells of human 5-hydroxytryptamine 2C receptor
In DepthDetails ArticlePubMed
TargetD(1A) dopamine receptor(RAT)
H. Lundbeck
Curated by ChEMBL
LigandPNGBDBM50122809(3-(2-{4-[1-(4-Fluoro-phenyl)-5-(1-methyl-1H-[1,2,4...)
Affinity DataKi:  5.60E+3nM. Assay description: Ability to displace [3H]-SCH- 23390 (0.2 nM) from corpus striatum of rat Dopamine receptor D1
In DepthDetails ArticlePubMed
TargetD(3) dopamine receptor(Homo sapiens (Human))
H. Lundbeck
Curated by ChEMBL
LigandPNGBDBM50122809(3-(2-{4-[1-(4-Fluoro-phenyl)-5-(1-methyl-1H-[1,2,4...)
Affinity DataKi: >7.10E+3nM. Assay description: Ability to displace [3H]spiperone (0.3 nM) from CHO cells of human Dopamine receptor D3
In DepthDetails ArticlePubMed
TargetD(4) dopamine receptor(Homo sapiens (Human))
H. Lundbeck
Curated by ChEMBL
LigandPNGBDBM50122809(3-(2-{4-[1-(4-Fluoro-phenyl)-5-(1-methyl-1H-[1,2,4...)
Affinity DataKi:  7.20E+3nM. Assay description: Displacement of [3H]-YM-09151-2 (0.06 nM) from human Dopamine receptor D4 expressed in CHO cells
In DepthDetails ArticlePubMed