BDBM50123320 7-Methoxy-6-oxazol-5-yl-2-thiophen-3-yl-1H-quinolin-4-one::CHEMBL347721
SMILES COc1cc2nc(cc(O)c2cc1-c1cnco1)-c1ccsc1
InChI Key InChIKey=DLLZWTUVQOIQHJ-UHFFFAOYSA-N
Data  2 IC50
  Tab Delimited (TSV)   2D SDfile   Computed 3D by Vconf -m prep SDfile
Find this compound or compounds like it in BindingDB:
Activity Spreadsheet -- Enzyme Inhibition Constant Data from BindingDB
Found 2 hits for monomerid = 50123320
TargetInosine-5'-monophosphate dehydrogenase 1(Homo sapiens (Human))
Bristol-Myers Squibb Pri
Curated by ChEMBL
LigandPNGBDBM50123320(7-Methoxy-6-oxazol-5-yl-2-thiophen-3-yl-1H-quinoli...)
Affinity DataIC50:  55nM. Assay description: Inhibitory activity of the compound against inosine monophosphate dehydrogenase IMPDH type I
In DepthDetails ArticlePubMed
TargetInosine-5'-monophosphate dehydrogenase 2(Homo sapiens (Human))
Bristol-Myers Squibb Pri
Curated by ChEMBL
LigandPNGBDBM50123320(7-Methoxy-6-oxazol-5-yl-2-thiophen-3-yl-1H-quinoli...)
Affinity DataIC50:  9nM. Assay description: Inhibition of human inosine monophosphate dehydrogenase IMPDH II
In DepthDetails ArticlePubMed