BDBM50123322 2-(3-Methanesulfonyl-phenyl)-7-methoxy-6-oxazol-5-yl-1H-quinolin-4-one::CHEMBL358383
SMILES COc1cc2nc(cc(O)c2cc1-c1cnco1)-c1cccc(c1)S(C)(=O)=O
InChI Key InChIKey=JUGYBDYFATVQOV-UHFFFAOYSA-N
Data  1 IC50
  Tab Delimited (TSV)   2D SDfile   Computed 3D by Vconf -m prep SDfile
Find this compound or compounds like it in BindingDB:
Activity Spreadsheet -- Enzyme Inhibition Constant Data from BindingDB
Found 1 hit for monomerid = 50123322
TargetInosine-5'-monophosphate dehydrogenase 2(Homo sapiens (Human))
Bristol-Myers Squibb Pri
Curated by ChEMBL
LigandPNGBDBM50123322(2-(3-Methanesulfonyl-phenyl)-7-methoxy-6-oxazol-5-...)
Affinity DataIC50:  160nM. Assay description: Inhibition of human inosine monophosphate dehydrogenase IMPDH II
In DepthDetails ArticlePubMed