BDBM50123373 2-((2R,3R)-3-Dimethylamino-2-methoxy-indan-5-yl)-7-methoxy-6-oxazol-5-yl-1H-quinolin-4-one::CHEMBL434894
SMILES CO[C@@H]1Cc2ccc(cc2[C@H]1N(C)C)-c1cc(O)c2cc(-c3cnco3)c(OC)cc2n1
InChI Key InChIKey=UUCFPVDYHFMUEC-ILBGXUMGSA-N
Data  1 IC50
  Tab Delimited (TSV)   2D SDfile   Computed 3D by Vconf -m prep SDfile
Find this compound or compounds like it in BindingDB:
Activity Spreadsheet -- Enzyme Inhibition Constant Data from BindingDB
Found 1 hit for monomerid = 50123373
TargetInosine-5'-monophosphate dehydrogenase 2(Homo sapiens (Human))
Bristol-Myers Squibb Pri
Curated by ChEMBL
LigandPNGBDBM50123373(2-((2R,3R)-3-Dimethylamino-2-methoxy-indan-5-yl)-7...)
Affinity DataIC50:  15nM. Assay description: Inhibitory activity against inosine monophosphate dehydrogenase IMPDH II
In DepthDetails ArticlePubMed