BDBM50123493 CHEMBL142566::N-(6-Amino-2-methyl-pyridin-3-ylmethyl)-2-[6-methyl-2-oxo-3-(2-phenyl-propylamino)-2H-pyrazin-1-yl]-acetamide
SMILES CC(CNc1ncc(C)n(CC(=O)NCc2ccc(N)nc2C)c1=O)c1ccccc1
InChI Key InChIKey=YZWURRGBTOVYDU-UHFFFAOYSA-N
Data  2 KI
  Tab Delimited (TSV)   2D SDfile   Computed 3D by Vconf -m prep SDfile
Find this compound or compounds like it in BindingDB:
Activity Spreadsheet -- Enzyme Inhibition Constant Data from BindingDB
Found 2 hits for monomerid = 50123493
TargetProthrombin(Homo sapiens (Human))
Merck Research Laboratories
Curated by ChEMBL
LigandPNGBDBM50123493(CHEMBL142566 | N-(6-Amino-2-methyl-pyridin-3-ylmet...)
Affinity DataKi:  1.10nM. Assay description: Inhibitory constant against thrombin (IIa)
In DepthDetails ArticlePubMed
TargetSerine protease 1(Homo sapiens (Human))
Merck Research Laboratories
Curated by ChEMBL
LigandPNGBDBM50123493(CHEMBL142566 | N-(6-Amino-2-methyl-pyridin-3-ylmet...)
Affinity DataKi:  1.60E+3nM. Assay description: Inhibitory constant against human trypsin
In DepthDetails ArticlePubMed